BDBM506786 US11046651, Compound 8
SMILES CC(C)(CN1CCN(CC1)C1=Nc2ccccc2Cc2ccccc12)C(O)=O
InChI Key InChIKey=DMYWKEKMOKMLKU-UHFFFAOYSA-N
Data  5 KI
  Tab Delimited (TSV)   2D SDfile   Computed 3D by Vconf -m prep SDfile
Find this compound or compounds like it in BindingDB:
Activity Spreadsheet -- Enzyme Inhibition Constant Data from BindingDB
Found 1 hit for monomerid = 506786
Target5-hydroxytryptamine receptor 2C(Homo sapiens (Human))
Alairion
US Patent
LigandPNGBDBM506786(US11046651, Compound 8)
Affinity DataKi: >50nM. Assay description: 1 μL of a compound of the present disclosure the reference compound (Table J) was transferred to an assay plate. 1 μL of 0.2 mM SB-206533 w...
Ligand InfoPC cidPC sid
In DepthDetails US Patent